{"text_format":"3","workbook":"xlsx","n_sheets":8,"sheets":["Variablen","Version_Kennwort","Stammdaten","Antrag und Erstattungssatz ","Kosten und Förderung","Günstigerprüfung_Solo","Zusammenfassung","Rechtliche Grundlagen"],"not_rendered":{"images":1,"defined_names":39,"comments":2},"read":"whole","date_system":"1900"}

{"sheet":"Variablen","index":0,"n_rows":22,"n_cols":4,"rows_kept":22,"hidden":true}
["Variablen"]
[]
[]
[null,"Umsatzeinbruch","Erstattungssatz"]
[null,{"v":0.7,"d":"70%"},{"v":0.9,"d":"90%"}]
[null,{"v":0.5,"d":"50%"},{"v":0.6,"d":"60%"}]
[null,{"v":0.3,"d":"30%"},{"v":0.4,"d":"40%"}]
[null,"Solo",{"v":0.25,"d":"25%"},5000]
[]
[]
[]
[]
["Förderung Personenunternehmen NRW Monatlich",{"v":1000,"d":"1,000.00 €"}]
[]
[]
["Textvariabeln"]
["Die Förderfähigkeit ist aufgrund eines Umsatzrückgangs in den Monaten"]
["unabhängig von einer bundesweiten Schließung gegeben."]
["Für den Monat Dezember 2020 wurde ein Umsatzrückgang von mindestens 30% festgestellt. Sollte das Unternehmen von einer bundesweiten Schließung betroffen sein, erhöht sich der maximale Fixkostenzuschss auf 500.000 €."]
[]
["Die Förderung nach tatsächlichen Kosten ist günstiger."]
["Die Förderung durch die Betriebskostenpauschale für Soloselbständige ist günstiger."]

{"sheet":"Version_Kennwort","index":1,"n_rows":37,"n_cols":2,"rows_kept":37,"merged":[[0,1,0,6],[4,1,4,3],[5,1,5,2],[13,1,13,9],[15,1,15,6],[18,1,18,7],[19,1,19,6],[24,1,24,3],[25,1,25,8],[26,1,26,8],[28,1,28,2],[29,1,29,4],[30,1,30,4],[31,1,31,3],[32,1,32,4],[33,1,33,2],[34,1,34,2],[36,1,36,3]]}
[null,"Überbrückungshilfe Phase 3\nHinweise und Impressum"]
[]
[null,"1. Versionshinweis"]
[null,"Version 2021.13.1"]
[null,"Stand: 31. März 2021 - berücksicht werden die FAQ mit Stand 24. März 2021"]
[null,"Vorliegen einer aktuelleren Version in der NWB Datenbank prüfen."]
[null,"NWB DOI XAAAH-68524"]
[]
[null,"2. Eingabefelder"]
[null,"Die Eingabefelder sind gelb hinterlegt."]
[]
[null,"3. Schreibschutz / Kennwort "]
[]
[null,"Die Arbeitsblätter sind - abgesehen von den Eingabefeldern - mit einem Schreibschutz belegt."]
[]
[null,"Das Kennwort für die Aufhebung des Schreibschutzes lautet:"]
[null,"nwbverlag"]
[]
[null,"Bitte beachten Sie, dass sich eine Veränderung der Gestaltung des Formulars auch"]
[null,"auf die Richtigkeit der Berechnungsformeln auswirken können. "]
[]
[null,"4. Autor"]
[null,"Dieses Berechnungsprogramm wird inhaltlich betreut von Olaf Stein."]
[]
[null,"5. Haftungsausschluss / AGB"]
[null,"Der NWB Verlag übernimmt keine Gewähr und keine Haftung für die Richtigkeit der Ergebnisse."]
[null,"Im Übrigen gelten die die aktuellen AGB der NWB Datenbank und des NWB Verlages."]
[]
[null,"6. Impressum"]
[null,"NWB Verlag GmbH & Co. KG"]
{"$rows_left_out":8}
{"sheet":"Stammdaten","index":2,"n_rows":23,"n_cols":14,"rows_kept":23,"merged":[[0,1,0,7],[2,1,2,7],[4,2,4,7],[5,2,5,7],[6,2,6,7],[7,2,7,7],[10,3,10,7],[13,1,13,7],[19,1,19,7],[22,1,22,5]]}
[null,"Überbrückungshilfe Phase 3\nStammdaten"]
[]
[null,"1. Adresse und Gründungsdatum"]
[]
[null,"Mandantennummer"]
[null,"Name des Betriebes",{"$nulls":9},"Ja"]
[null,"Straße und Hausnr.",{"$nulls":9},"Nein"]
[null,"PLZ / Ort"]
[null,"Gründungsdatum","2019-01-01"]
[null,"Soloselbständiger?","Ja"]
[null,"Auswahl Vergleichsumsatz für \n- Soloselbständige mit Aufnahme der Tätigkeit vor dem 01.01.2019\n- Unternehmen mit Gründungsdatum \nzwischen dem 01.01.2019 und dem 30.04.2020 \nbzw. \n- Soloselbständige oder selbständige Angehörige der freien Berufe mit Aufnahme der selbständigen oder freiberuflichen Tätigkeit \nzwischen dem 01.01.2019 und dem 30.04.2020\n- Verbundene Unternehmen","trifft nicht zu","Vergleichsumsatz = \n1. Durchschnittlicher Monatsumsatz des Jahres 2019\n2. Durchschnittlicher Monatsumsatz der beiden Vorkrisenmonate Januar und Februar 2020\n3. Durchschnittlicher Monatsumsatz in den Monaten Juni bis September 2020\n4. Monatlicher Durchschnittswert des geschätzten Jahresumsatzes 2020, der bei der erstmaligen steuerlichen Erfassung beim zuständigen Finanzamt im „Fragebogen zur steuerlichen Erfassung“ angegeben wurde. Hierfür gilt eine maximale Höhe der Überbrückungshilfe von insgesamt 1.800.000 Euro.\n5. Verbundene Unternehmen: Kumulierter Umsatz. Hierfür gilt eine maximale Höhe der Überbrückungshilfe von insgesamt 3.000.000 Euro.\n6. KMU: Durchschnittlicher Monatsumsatz des Jahres 2019",{"$nulls":7},"1.",{"$f":"IF(Soloselbständiger=\"ja\",\"Durchschnittlicher Monatsumsatz des Jahres 2019\",\"Bitte Eingaben im Blatt 'Stammdaten' überprüfen.\")","v":"Durchschnittlicher Monatsumsatz des Jahres 2019"}]
[{"$nulls":11},{"$f":"IF(Gründungsdatum>=DATE(2019,1,1),\"2.\",\"-\")","v":"2."},"Durchschnittlicher Monatsumsatz der beiden Vorkrisenmonate Januar und Februar 2020"]
[{"$nulls":11},{"$f":"IF(Gründungsdatum>=DATE(2019,1,1),\"3.\",\"-\")","v":"3."},{"$f":"IF(Gründungsdatum>=DATE(2019,1,1),\"Durchschnittlicher Monatsumsatz in den Monaten Juni bis September 2020\",\"Bitte Eingaben im Blatt 'Stammdaten' überprüfen.\")","v":"Durchschnittlicher Monatsumsatz in den Monaten Juni bis September 2020"},"Monatlicher Durchschnittswert des geschätzten Jahresumsatzes 2020, der bei der erstmaligen steuerlichen Erfassung beim zuständigen Finanzamt im „Fragebogen zur steuerlichen Erfassung“ angegeben wurde. Hierfür gilt eine maximale Höhe der Überbrückungshilfe von insgesamt 1.800.000 Euro."]
[null,"2. Art der Berechnung",{"$nulls":9},{"$f":"IF(Gründungsdatum>=DATE(2019,1,1),\"4.\",\"-\")","v":"4."},{"$f":"IF(Gründungsdatum>=DATE(2019,1,1),+N13,\"Bitte Eingaben im Blatt 'Stammdaten' überprüfen.\")","v":"Monatlicher Durchschnittswert des geschätzten Jahresumsatzes 2020, der bei der erstmaligen steuerlichen Erfassung beim zuständigen Finanzamt im „Fragebogen zur steuerlichen Erfassung“ angegeben wurde. Hierfür gilt eine maximale Höhe der Überbrückungshilfe von insgesamt 1.800.000 Euro."}]
[{"$nulls":11},{"$f":"IF(Gründungsdatum>=DATE(2019,1,1),\"5.\",\"-\")","v":"5."},{"$f":"IF(Gründungsdatum>=DATE(2019,1,1),\"Verbundene Unternehmen: Kumulierter Umsatz. Hierfür gilt eine maximale Höhe der Überbrückungshilfe von insgesamt 3.000.000 Euro.\",\"Bitte Eingaben im Blatt 'Stammdaten' überprüfen.\")","v":"Verbundene Unternehmen: Kumulierter Umsatz. Hierfür gilt eine maximale Höhe der Überbrückungshilfe von insgesamt 3.000.000 Euro."}]
[null,"Umsatzschätzung bei Antragstellung 1",{"$nulls":9},"6.","KMU: Durchschnittlicher Monatsumsatz des Jahres 2019"]
[null,"oder",1,{"$nulls":8},"trifft nicht zu","Umsatz Monat Vorjahr"]
[null,"abschließende Antragstellung = Ist-Werte 2"]
[]
[null,"3. Antragsberechtigung nach Angaben zu Unternehmen "]
[]
[null,{"$f":"+IF(Gründungsdatum<= DATEVALUE(\"30.4.2020\"),IF(Gründungsdatum>= DATEVALUE(\"1.8.2019\"),\"Bitte anderes Berechnungstool verwenden!\",\"Das Unternehmen ist antragsberechtigt.\"),\"Das Unternehmen ist nicht antragsberechtigt.\")","v":"Das Unternehmen ist antragsberechtigt."}]
[null,{"$f":"IF(Soloselbständiger=\"Ja\",\"Bitte die Günstigerprüfung für Soloselbständige beachten (Blatt 'Günstigerprüfung_Solo').\",\"\")","v":"Bitte die Günstigerprüfung für Soloselbständige beachten (Blatt 'Günstigerprüfung_Solo')."}]

{"sheet":"Antrag und Erstattungssatz ","index":3,"n_rows":22,"n_cols":10,"rows_kept":22,"merged":[[0,1,0,9],[19,1,19,9]]}
[null,"Überbrückungshilfe Phase 3\nErstattungssatz"]
[]
[]
[null,null,"Nov","Dez","Jan","Feb","März","April","Mai","Juni"]
[null,"Umsatz Jahr 2020/2021",{"v":5000,"d":"5,000.00"},{"v":5000,"d":"5,000.00"},{"v":0,"d":"0.00"},{"v":0,"d":"0.00"},{"v":0,"d":"0.00"},{"v":2000,"d":"2,000.00"},{"v":1500,"d":"1,500.00"},{"v":1500,"d":"1,500.00"}]
[null,{"$f":"VLOOKUP(Stammdaten!C11,Stammdaten!L11:M17,2,TRUE)","v":"Umsatz Monat Vorjahr"},{"v":10000,"d":"10,000.00"},{"v":10000,"d":"10,000.00"},{"v":7000,"d":"7,000.00"},{"v":0,"d":"0.00"},{"v":0,"d":"0.00"},{"v":1000,"d":"1,000.00"},{"v":7000,"d":"7,000.00"},{"v":7000,"d":"7,000.00"}]
[null,"Auswahl Vergleichsumsatz siehe Blatt \"Stammdaten\""]
[null,"Umsatzrückgang absolut",{"$f":"+C5-C6","v":{"v":-5000,"d":"-5,000.00 "}},{"v":-5000,"d":"-5,000.00 "},{"v":-7000,"d":"-7,000.00 "},{"v":0,"d":"0.00"},{"v":0,"d":"0.00"},{"v":1000,"d":"1,000.00"},{"v":-5500,"d":"-5,500.00 "},{"v":-5500,"d":"-5,500.00 "}]
[null,"Umsatzrückgang in %",{"$f":"((-C8+0.01)/(C6+0.01))","v":{"v":0.5000004999995,"d":"50.00%"}},{"v":0.5000004999995,"d":"50.00%"},{"v":1,"d":"100.00%"},{"v":1,"d":"100.00%"},{"v":1,"d":"100.00%"},{"v":-0.999980000199998,"d":"-100.00%"},{"v":0.7857145918362974,"d":"78.57%"},{"v":0.7857145918362974,"d":"78.57%"}]
[]
[null,"Antragsberechtigung ist gegeben:",{"$f":"+IF(C9>=30%,\"Ja\",\"Nein\")","v":"Ja"},{"$f":"+IF(D9>=30%,\"Ja\",\"Nein\")","v":"Ja"},"Ja","Ja","Ja","Nein","Ja","Ja"]
[]
[null,"Erstattungssatz",{"$f":"+IF(Umsatzrückgang_in<=Variablen!B7,0,IF(Umsatzrückgang_in<=Variablen!B6,Variablen!C7,IF(Umsatzrückgang_in<=Variablen!B5,Variablen!C6,Variablen!C5)))","v":{"v":0.6,"d":"60.00%"}},{"v":0.6,"d":"60.00%"},{"v":0.9,"d":"90.00%"},{"v":0.9,"d":"90.00%"},{"v":0.9,"d":"90.00%"},{"v":0,"d":"0.00%"},{"v":0.9,"d":"90.00%"},{"v":0.9,"d":"90.00%"}]
[]
[null,"Die Ersattungssätze lauten:","Umsatzeinbruch","Erstattungssatz"]
[null,null,">= 70%",{"v":0.9,"d":"90%"}]
[null,null,">= 50%",{"v":0.6,"d":"60%"}]
[null,null,">= 30%",{"v":0.4,"d":"40%"}]
[]
[null,"Bitte beachten: Ggf. muss ein bereits gestellter Antrag auf Nov.-/ Dez.-Hilfe zugunsten eines höher beförderten Antrages auf Nov.-/ Dez.-Hilfe PLUS im Rahmen der Überbrückungshilfe 3 zurückgezogen werden. \nDieses Vorgehen ist jeweils individuell zu prüfen."]
[]
[null,{"$f":"IF(Stammdaten!C10=\"Ja\",\"Bitte die Günstigerprüfung für Soloselbständige beachten (Blatt 'Günstigerprüfung_Solo').\",\"\")","v":"Bitte die Günstigerprüfung für Soloselbständige beachten (Blatt 'Günstigerprüfung_Solo')."}]

{"sheet":"Kosten und Förderung","index":4,"n_rows":39,"n_cols":22,"rows_kept":39,"merged":[[0,1,0,11],[3,1,3,2],[33,1,33,4],[35,1,35,2],[36,1,36,2],[37,1,37,2],[38,1,38,2]]}
[null,"Überbrückungshilfe Phase 3\nKosten und Förderung"]
[]
[]
[null,"1. Berücksichtigungsfähige Kosten"]
[{"$nulls":3},"2020-11-01","2020-12-01","2021-01-01","2021-02-01","2021-03-01","2021-04-01","2021-05-01","2021-06-01"]
[null,"1.","Mieten und Pachten",{"v":100,"d":"100.00"},{"v":1000,"d":"1,000.00"},{"v":100,"d":"100.00"},{"v":100,"d":"100.00"},{"v":100,"d":"100.00"},{"v":100,"d":"100.00"},{"v":100,"d":"100.00"},{"v":100,"d":"100.00"}]
[null,"2.","weitere Mietkosten"]
[null,"3.","Zinsaufwendungen für Kredite und Darlehen"]
[null,"4.","Abschreibungen auf Wirtschaftsgüter des AV\n- näheres siehe Anhang 2 der FAQ",{"v":400,"d":"400.00"},{"v":200,"d":"200.00"},{"v":400,"d":"400.00"},{"v":400,"d":"400.00"},{"v":400,"d":"400.00"},{"v":400,"d":"400.00"},{"v":400,"d":"400.00"},{"v":400,"d":"400.00"}]
[null,"4a.","- davon zu berücksichtigen: 50%",{"$f":"+Abschreibungen*0.5","v":{"v":200,"d":"200.00"}},{"v":100,"d":"100.00"},{"v":200,"d":"200.00"},{"v":200,"d":"200.00"},{"v":200,"d":"200.00"},{"v":200,"d":"200.00"},{"v":200,"d":"200.00"},{"v":200,"d":"200.00"}]
[null,"5.","Finanzierungskostenanteil von Leasingraten"]
[null,"6.","Ausgaben für notwendige Instandhaltung, Wartung und Einlagerung von Anlagevermögen und gemieteten und geleasten Vermögensgegenständen, einschließlich EDV"]
[null,"7.","Ausgaben für Elektrizität, Wasser, Heizung, Reinigung"]
[null,"8.","Grundsteuern"]
[null,"9.","Betriebliche Lizenzgebühren"]
[null,"10.","Versicherungen, Abonnements und \nandere feste Ausgaben"]
[null,"11.","Kosten für Steuerberater, Wirtschaftsprüfer oder vereidigte Buchprüfer, die im Rahmen der Beantragung der Corona-Überbrückungshilfe Phase 3 anfallen. ",{"v":100,"d":"100.00"},{"v":100,"d":"100.00"},{"v":200,"d":"200.00"},{"v":200,"d":"200.00"},{"v":200,"d":"200.00"},{"v":200,"d":"200.00"},{"v":200,"d":"200.00"},{"v":200,"d":"200.00"}]
[null,"12.","Personalaufwendungen gegeben (ja/nein)","Ja","Ja","Ja","Ja","Ja","Ja","Ja","Nein"]
[null,"12a.","(werden pauschal mit 20 % der Fixkosten \nNr. 1 - 11 berücksichtigt)",{"$f":"IF(D18=\"Ja\",SUM(D6:D8,D10:D13,D14:D17)*0.2,0)","v":{"v":80,"d":"80.00"}},{"v":240,"d":"240.00"},{"v":100,"d":"100.00"},{"v":100,"d":"100.00"},{"v":100,"d":"100.00"},{"v":100,"d":"100.00"},{"v":100,"d":"100.00"},{"v":0,"d":"0.00"}]
[null,"13.","Kosten für Auszubildende"]
[null,"14.","bauliche Modernisierungs-, Renovierungs- oder Umbaumaßnahmen für Hygienemaßnahmen Investitionen in Digitalisierung (z.B. Online-Shop); Summe aus 14a. Und 14b.",{"$f":"D23+D25","v":{"v":39672.13114754098,"d":"39,672.13"}}]
[null,"14a.","bauliche Modernisierungs-, Renovierungs- oder Umbaumaßnahmen für Hygienemaßnahmen",{"v":30000,"d":"30,000.00"},{"v":10000,"d":"10,000.00"},null,{"v":30000,"d":"30,000.00"}]
[null,"14a.","- davon zu berücksichtigen: max. 20.000 € monatlich",{"$f":"IF(D22>20000,20000,D22)","v":{"v":20000,"d":"20,000.00"}},{"$f":"IF(E22>20000,20000,E22)","v":{"v":10000,"d":"10,000.00"}},{"v":0,"d":"0.00"},{"v":20000,"d":"20,000.00"},{"v":0,"d":"0.00"},{"v":0,"d":"0.00"},{"v":0,"d":"0.00"},{"v":0,"d":"0.00"}]
[null,"14b.","Investitionen in Digitalisierung im Zeitraum März 2020 - Juni 2021",{"v":30000,"d":"30,000.00"},{"v":500,"d":"500.00"},{"$nulls":8},{"$f":"SUM(D24:K24)","v":{"v":30500,"d":"30,500.00 €"}},{"$f":"IF(D24>0,1,0)","v":1},{"$f":"IF(E25>0,1,0)","v":1},0,0,0,0,0,0]
[null,"14b.","- davon zu berücksichtigen: 20.000 €",{"$f":"IFERROR(D24/N24*N25,0)","v":{"v":19672.131147540982,"d":"19,672.13"}},{"$f":"IFERROR(E24/N24*N25,0)","v":{"v":327.8688524590164,"d":"327.87"}},{"$f":"IFERROR(F24/N24*N25,0)","v":{"v":0,"d":"0.00"}},{"$f":"IFERROR(G24/N24*N25,0)","v":{"v":0,"d":"0.00"}},{"$f":"IFERROR(H24/N24*N25,0)","v":{"v":0,"d":"0.00"}},{"$f":"IFERROR(I24/N24*N25,0)","v":{"v":0,"d":"0.00"}},{"$f":"IFERROR(J24/N24*N25,0)","v":{"v":0,"d":"0.00"}},{"$f":"IFERROR(K24/N24*N25,0)","v":{"v":0,"d":"0.00"}},null,null,{"$f":"IF(N24>20000,20000,N24)","v":{"v":20000,"d":"20,000.00 €"}}]
[null,"15.","Marketing\nMaximal in Höhe der entsprechenden Ausgaben im Jahre 2019. Bei Unternehmen, die zwischen dem 1. Januar 2019 und dem 30. April 2020 gegründet wurden: Marketing- und Werbekosten maximal in Höhe der entsprechenden Ausgaben für zwölf Monate in einem beliebigen Zeitraum seit Gründung."]
[null,"16.","Reisebranche: \n1. Zurückgezahlte bzw. ausgebliebene Provisionen für Reisebüros oder Margen für Reiseveranstalter für Pauschalreisen, die  \n- vor dem 18.03.2020 gebucht, \n- seit dem 18.03.2020 im Zusammenhang mit Corona-bedingten Reisewarnungen des Auswärtigen Amtes bzw. innerdeutschen Reiseverboten oder temporären Grenzschließungen storniert (Rücktritt vom Reisevertrag) und  \n- die bis zum 31.08.2020 von den Reisenden angetreten worden wären.\n2. bei zusätzlich erstattungsfähigen Kosten für Zeitraum 01.03.2020 bis 31.12.2020 und Umsatzrückgang > 30%: Personalkostenpauschale i.H.v. 50%"]
[null,"17.","Veranstaltungs- und Kulturbranche: Ausfall- und Vorbereitungskosten\n- wenn Umsatzrückgang >30%; weiteres siehe Anhang 1 der FAQ"]
[null,"18.","Einzelhandel: Wertverlust für verderbliche Ware und Saisonware\n- im Vergleichsmonat 2019  muss mindestens 70% des Umsatz aus Stationärem Handel erzielt worden sein"]
[null,"19.","Kosten für Unternehmen der Pyrotechnikindustrie\n- für Dezember 2020 muss ein Umsatzeinbruch von mind. 80% vorliegen"]
{"$rows_left_out":10}
{"sheet":"Günstigerprüfung_Solo","index":5,"n_rows":25,"n_cols":19,"rows_kept":25,"merged":[[0,1,0,14],[3,1,3,7],[14,11,14,14],[15,7,15,9],[15,11,15,13],[16,7,16,8],[16,11,16,13]]}
[null,"Überbrückungshilfe Phase 3\nGünstigerprüfung für Soloselbständige"]
[]
[]
[null,{"$f":"+IF(Soloselbständiger=\"ja\",\"Vergleich: Summe maximaler Förderbetrag vs. 50% des Vergleichsumsatz, maximal 7.500 Euro.\",\"Diese Rechnung ist nur für Soloselbständige relvant.\")","v":"Vergleich: Summe maximaler Förderbetrag vs. 50% des Vergleichsumsatz, maximal 7.500 Euro."}]
[]
[null,"Berechnung der einmaligen Betriebskostenpauschale:"]
[{"$nulls":16},"Monat","Zählung","Ja"]
[null,null,"2019-01-01","2019-02-01","2019-03-01","2019-04-01","2019-05-01","2019-06-01","2019-07-01","2019-08-01","2019-09-01","2019-10-01","2019-11-01","2019-12-01","Summe",null,"Jan",{"$f":"IF(C9=\"Ja\",1,0)","v":0},"Nein"]
[null,"Im Monat bereits gegründet?","Nein","Nein","Nein","Ja","Ja","Ja","Ja","Ja","Ja","Ja","Ja","Ja",null,null,"Feb",{"$f":"IF(D9=\"Ja\",1,0)","v":0}]
[null,"Umsatz",{"v":10000,"d":"10,000.00"},{"v":1000,"d":"1,000.00"},{"v":1000,"d":"1,000.00"},{"v":5000,"d":"5,000.00"},{"v":1000,"d":"1,000.00"},{"v":20000,"d":"20,000.00"},{"v":1000,"d":"1,000.00"},{"v":1000,"d":"1,000.00"},{"v":1000,"d":"1,000.00"},{"v":1000,"d":"1,000.00"},{"v":1000,"d":"1,000.00"},{"v":1000,"d":"1,000.00"},null,null,"März",{"$f":"IF(E9=\"Ja\",1,0)","v":0}]
[null,"berücksichtigt \nwird",{"$f":"IF(C9=\"Ja\",C10,0)","v":{"v":0,"d":"0.00"}},{"$f":"IF(D9=\"Ja\",D10,0)","v":{"v":0,"d":"0.00"}},{"v":0,"d":"0.00"},{"v":5000,"d":"5,000.00"},{"v":1000,"d":"1,000.00"},{"v":20000,"d":"20,000.00"},{"v":1000,"d":"1,000.00"},{"v":1000,"d":"1,000.00"},{"v":1000,"d":"1,000.00"},{"v":1000,"d":"1,000.00"},{"v":1000,"d":"1,000.00"},{"v":1000,"d":"1,000.00"},{"$f":"SUM(C11:N11)","v":{"v":32000,"d":"32,000.00"}},null,"April",{"$f":"IF(F9=\"Ja\",1,0)","v":1}]
[{"$nulls":16},"Mai",{"$f":"IF(G9=\"Ja\",1,0)","v":1}]
[{"$nulls":7},"= Summe Umsatz",null,null,{"$f":"O11","v":{"v":32000,"d":"32,000.00 €"}},{"$nulls":5},"Juni",{"$f":"IF(H9=\"Ja\",1,0)","v":1}]
[{"$nulls":7},"= Summe Öffnungsmonate",null,null,{"$f":"R21","v":9},{"$nulls":5},"Juli",{"$f":"IF(I9=\"Ja\",1,0)","v":1}]
[{"$nulls":7},"= Summe / Öffnungsmonate * 12 Monate",null,null,{"$f":"O11/R21*12","v":{"v":42666.66666666667,"d":"42,666.67 €"}},"= Vergleichsumsatz \n(nach Öffnungsmonaten gewichteter Umsatz)",{"$nulls":4},"August",{"$f":"IF(J9=\"Ja\",1,0)","v":1}]
[{"$nulls":7}," = Vergleichsumsatz /2 = ",null,null,{"$f":"+K15/2","v":{"v":21333.333333333336,"d":"21,333.33 €"}}," = Referenzumsatz "]
[{"$nulls":7},"davon 50%; max. 7.500 €",null,null,{"$f":"IF(K15*0.25>7500,7500,K15*0.25)","v":{"v":7500,"d":"7,500.00 €"}},"= einmalige Betriebskostenpauschale",{"$nulls":4},"Sept",{"$f":"IF(K9=\"Ja\",1,0)","v":1}]
[{"$nulls":16},"Okt",{"$f":"IF(L9=\"Ja\",1,0)","v":1}]
[{"$nulls":16},"Nov",{"$f":"IF(M9=\"Ja\",1,0)","v":1}]
[null,"Prüfung: Antrag Betriebskostenpauschale vs. tatsächliche Kosten",{"$nulls":14},"Dez",{"$f":"IF(N9=\"Ja\",1,0)","v":1}]
[null,null,"Einmalige Betriebskostenpauschale",{"$nulls":6},{"$f":"K17","v":{"v":7500,"d":"7,500.00 €"}},{"$nulls":6},"Summe",{"$f":"SUM(R8:R20)","v":9}]
[null,null,"Maximaler Förderbetrag Stufe 2 (siehe Blatt \"Kosten und Förderung\")",{"$nulls":6},{"$f":"+'Kosten und Förderung'!L38","v":{"v":52062,"d":"52,062.00 €"}}]
[]
[null,null,"Es sollte beantragt werden:"]
[null,null,{"$f":"IF(Soloselbständiger=\"ja\",IF(J21>J22,\"Einmalige Betriebskostenpauschale\",\"Förderung nach tatsächlichen Kosten\"),\"Da der Antragsteller kein Soloselbständier ist, wird auf die Regelförderung verwiesen\")","v":"Förderung nach tatsächlichen Kosten"}]

{"sheet":"Zusammenfassung","index":6,"n_rows":32,"n_cols":10,"rows_kept":32,"merged":[[0,1,0,9],[4,2,4,5],[5,2,5,5],[6,2,6,5],[7,2,7,5],[35,4,35,5]]}
[null,"Überbrückungshilfe Phase 3\nZusammenfassung"]
[]
[]
[null,"1. Antragsberechtiger"]
[null,{"$f":"Stammdaten!B5","v":"Mandantennummer"},{"$f":"+Stammdaten!C5","v":0}]
[null,{"$f":"Stammdaten!B6","v":"Name des Betriebes"},{"$f":"+Stammdaten!C6","v":0}]
[null,{"$f":"Stammdaten!B7","v":"Straße und Hausnr."},{"$f":"+Stammdaten!C7","v":0}]
[null,{"$f":"Stammdaten!B8","v":"PLZ / Ort"},{"$f":"+Stammdaten!C8","v":0}]
[]
[null,{"$f":"+IF(Gründungsdatum<= DATEVALUE(\"30.4.2020\"),IF(Gründungsdatum>= DATEVALUE(\"1.8.2019\"),\"Bitte anders Berechnungstool verwenden!\",_xlfn.CONCAT(\"Gründungsdatum \",TEXT(Gründungsdatum,\"-> TT.MM.JJJJ\"))),\"Unternehmen ist nicht antragsberechtigt.\")","v":"Gründungsdatum -> 01.01.2019"}]
[null,{"$f":"_xlfn.CONCAT(Stammdaten!B10,\" -> \",Soloselbständiger)","v":"Soloselbständiger? -> Ja"}]
[null,{"$f":"IF(Stammdaten!C11=\"5.\",\"Verbundenes Unternehmen? -> Ja\",\"Verbundenes Unternehmen? -> Nein\")","v":"Verbundenes Unternehmen? -> Nein"}]
[]
[null,"2. Förderfähigkeit"]
[null,null,"2020-11-01","2020-12-01","2021-01-01","2021-02-01","2021-03-01","2021-04-01","2021-05-01","2021-06-01"]
[null,null,{"$f":"+'Antrag und Erstattungssatz '!C11","v":"Ja"},{"$f":"+'Antrag und Erstattungssatz '!D11","v":"Ja"},{"$f":"+'Antrag und Erstattungssatz '!E11","v":"Ja"},{"$f":"+'Antrag und Erstattungssatz '!F11","v":"Ja"},{"$f":"+'Antrag und Erstattungssatz '!G11","v":"Ja"},{"$f":"+'Antrag und Erstattungssatz '!H11","v":"Nein"},{"$f":"+'Antrag und Erstattungssatz '!I11","v":"Ja"},{"$f":"+'Antrag und Erstattungssatz '!J11","v":"Ja"}]
[null,"3. Erstattungssätze und Förderung"]
[null,null,"2020-11-01","2020-12-01","2021-01-01","2021-02-01","2021-03-01","2021-04-01","2021-05-01","2021-06-01"]
[null,"Erstattungssatz",{"$f":"+Erstattungssatz","v":{"v":0.6,"d":"60%"}},{"v":0.6,"d":"60%"},{"v":0.9,"d":"90%"},{"v":0.9,"d":"90%"},{"v":0.9,"d":"90%"},{"v":0,"d":"0%"},{"v":0.9,"d":"90%"},{"v":0.9,"d":"90%"}]
[]
[null,{"$f":"'Kosten und Förderung'!B36","v":"Förderfähige Kosten"},{"$f":"+'Kosten und Förderung'!D36","v":{"v":40152.13114754098,"d":"40,152.13 €"}},{"$f":"+'Kosten und Förderung'!E36","v":{"v":12267.868852459016,"d":"12,267.87 €"}},{"$f":"+'Kosten und Förderung'!F36","v":{"v":600,"d":"600.00 €"}},{"$f":"+'Kosten und Förderung'!G36","v":{"v":20600,"d":"20,600.00 €"}},{"$f":"+'Kosten und Förderung'!H36","v":{"v":600,"d":"600.00 €"}},{"$f":"+'Kosten und Förderung'!I36","v":{"v":600,"d":"600.00 €"}},{"$f":"+'Kosten und Förderung'!J36","v":{"v":600,"d":"600.00 €"}},{"$f":"+'Kosten und Förderung'!K36","v":{"v":500,"d":"500.00 €"}}]
[null,{"$f":"'Kosten und Förderung'!B37","v":"Erstattung gem. maßgeblichem Erstattungssatz"},{"$f":"+'Kosten und Förderung'!D37","v":{"v":24091.278688524588,"d":"24,091.28 €"}},{"$f":"+'Kosten und Förderung'!E37","v":{"v":7360.7213114754095,"d":"7,360.72 €"}},{"$f":"+'Kosten und Förderung'!F37","v":{"v":540,"d":"540.00 €"}},{"$f":"+'Kosten und Förderung'!G37","v":{"v":18540,"d":"18,540.00 €"}},{"$f":"+'Kosten und Förderung'!H37","v":{"v":540,"d":"540.00 €"}},{"$f":"+'Kosten und Förderung'!I37","v":{"v":0,"d":"0.00 €"}},{"$f":"+'Kosten und Förderung'!J37","v":{"v":540,"d":"540.00 €"}},{"$f":"+'Kosten und Förderung'!K37","v":{"v":450,"d":"450.00 €"}}]
[null,"Maximaler Förderbetrag",{"$f":"'Kosten und Förderung'!D38","v":{"v":24091.278688524588,"d":"24,091.28 €"}},{"$f":"'Kosten und Förderung'!E38","v":{"v":7360.7213114754095,"d":"7,360.72 €"}},{"$f":"'Kosten und Förderung'!F38","v":{"v":540,"d":"540.00 €"}},{"$f":"'Kosten und Förderung'!G38","v":{"v":18540,"d":"18,540.00 €"}},{"$f":"'Kosten und Förderung'!H38","v":{"v":540,"d":"540.00 €"}},{"$f":"'Kosten und Förderung'!I38","v":{"v":0,"d":"0.00 €"}},{"$f":"'Kosten und Förderung'!J38","v":{"v":540,"d":"540.00 €"}},{"$f":"'Kosten und Förderung'!K38","v":{"v":450,"d":"450.00 €"}}]
[]
[null,"Summe Förderung bis Juni 2021",null,{"$f":"SUM(C23:J23)","v":{"v":52062,"d":"52,062.00 €"}}]
[]
[null,{"$f":"+IF(Soloselbständiger=\"ja\",\"5. Günstigerprüfung bei Soloselbständigen\",\"\")","v":"5. Günstigerprüfung bei Soloselbständigen"}]
[null,{"$f":"+IF(Soloselbständiger=\"ja\",\"Summe Vergleichsumsatz 2019\",\"\")","v":"Summe Vergleichsumsatz 2019"},{"$nulls":4},{"$f":"+IF(Soloselbständiger=\"ja\",Günstigerprüfung_Solo!K15,\"\")","v":{"v":42666.66666666667,"d":"42,666.67 €"}}]
[null,{"$f":"+IF(Soloselbständiger=\"ja\",\"Förderung: Betriebskostenpauschale = 50% des Referenzumsatz, Maximal 7.500 €\",\"\")","v":"Förderung: Betriebskostenpauschale = 50% des Referenzumsatz, Maximal 7.500 €"},{"$nulls":4},{"$f":"+IF(Soloselbständiger=\"ja\",Günstigerprüfung_Solo!K17,\"\")","v":{"v":7500,"d":"7,500.00 €"}}]
[null,{"$f":"+IF(Soloselbständiger=\"ja\",\"Im Vergleich die Förderung nach tatsächlichen Kosten\",\"\")","v":"Im Vergleich die Förderung nach tatsächlichen Kosten"},{"$nulls":4},{"$f":"+IF(Soloselbständiger=\"ja\",+D25,\"\")","v":{"v":52062,"d":"52,062.00 €"}}]
{"$rows_left_out":3}
{"sheet":"Rechtliche Grundlagen","index":7,"n_rows":1,"n_cols":2,"rows_kept":1,"merged":[[0,1,0,8]]}
[null,"Überbrückungshilfe Phase 3\nRechtliche Grundlagen"]